Unable to install NVIDIA-470 on Zorin Pro 16

Unable to install Nvidia 470 version

Kernal: 5.13.0-051300-generic
Apt Log:
`
Error! Bad return status for module build on kernel: 5.13.0-051300-generic (x86_
64)
Consult /var/lib/dkms/nvidia/470.86/build/make.log for more information.
dpkg: error processing package nvidia-dkms-470 (--configure):
installed nvidia-dkms-470 package post-installation script subprocess returned
error exit status 10
dpkg: dependency problems prevent configuration of nvidia-driver-470:
nvidia-driver-470 depends on nvidia-dkms-470 (<= 470.86-1); however:
Package nvidia-dkms-470 is not configured yet.
nvidia-driver-470 depends on nvidia-dkms-470 (>= 470.86); however:
Package nvidia-dkms-470 is not configured yet.

Make Log:
DKMS make.log for nvidia-470.86 for kernel 5.13.0-051300-generic (x86_64)
Sunday 05 December 2021 09:13:23 PM IST
make[1]: Entering directory '/usr/src/linux-headers-5.13.0-051300-generic'
test -e include/generated/autoconf.h -a -e include/config/auto.conf || (
echo >&2;
echo >&2 " ERROR: Kernel configuration is invalid.";
echo >&2 " include/generated/autoconf.h or include/config/auto.conf are missing.";
echo >&2 " Run 'make oldconfig && make prepare' on kernel src to fix it.";
echo >&2 ;
/bin/false)
make -f ./scripts/Makefile.build obj=/var/lib/dkms/nvidia/470.86/build
single-build=
need-builtin=1 need-modorder=1
ln -sf /var/lib/dkms/nvidia/470.86/build/nvidia/nv-kernel.o_binary /var/lib/dkms/nvidia/470.86/build/nvidia/nv-kernel.o
ln -sf /var/lib/dkms/nvidia/470.86/build/nvidia-modeset/nv-modeset-kernel.o_binary /var/lib/dkms/nvidia/470.86/build/nvidia-modeset/nv-modeset-kernel.o
CONFTEST: hash__remap_4k_pfn
CONFTEST: set_pages_uc
CONFTEST: list_is_first
CONFTEST: set_memory_uc
CONFTEST: set_memory_array_uc
CONFTEST: set_pages_array_uc
CONFTEST: acquire_console_sem
CONFTEST: console_lock
CONFTEST: ioremap_cache
CONFTEST: ioremap_wc
CONFTEST: acpi_walk_namespace
CONFTEST: sg_alloc_table
CONFTEST: pci_get_domain_bus_and_slot
CONFTEST: get_num_physpages
CONFTEST: efi_enabled
CONFTEST: pde_data
CONFTEST: proc_remove
CONFTEST: pm_vt_switch_required
CONFTEST: xen_ioemu_inject_msi
CONFTEST: phys_to_dma
CONFTEST: get_dma_ops
CONFTEST: dma_attr_macros
CONFTEST: dma_map_page_attrs
CONFTEST: write_cr4
CONFTEST: of_get_property
CONFTEST: of_find_node_by_phandle
CONFTEST: of_node_to_nid
CONFTEST: pnv_pci_get_npu_dev
CONFTEST: of_get_ibm_chip_id
CONFTEST: node_end_pfn
CONFTEST: pci_bus_address
CONFTEST: pci_stop_and_remove_bus_device
CONFTEST: pci_remove_bus_device
CONFTEST: register_cpu_notifier
CONFTEST: cpuhp_setup_state
CONFTEST: dma_map_resource
CONFTEST: backlight_device_register
CONFTEST: get_backlight_device_by_name
CONFTEST: timer_setup
CONFTEST: pci_enable_msix_range
CONFTEST: kernel_read_has_pointer_pos_arg
CONFTEST: kernel_write
CONFTEST: kthread_create_on_node
CONFTEST: of_find_matching_node
CONFTEST: dev_is_pci
CONFTEST: dma_direct_map_resource
CONFTEST: tegra_get_platform
CONFTEST: tegra_bpmp_send_receive
CONFTEST: flush_cache_all
CONFTEST: vmf_insert_pfn
CONFTEST: jiffies_to_timespec
CONFTEST: ktime_get_raw_ts64
CONFTEST: ktime_get_real_ts64
CONFTEST: full_name_hash
CONFTEST: hlist_for_each_entry
CONFTEST: pci_enable_atomic_ops_to_root
CONFTEST: vga_tryget
CONFTEST: pgprot_decrypted
CONFTEST: iterate_fd
CONFTEST: seq_read_iter
CONFTEST: sg_page_iter_page
CONFTEST: unsafe_follow_pfn
CONFTEST: drm_gem_object_get
CONFTEST: drm_gem_object_put_unlocked
CONFTEST: set_close_on_exec
CONFTEST: address_space_init_once
CONFTEST: kbasename
CONFTEST: vzalloc
CONFTEST: wait_on_bit_lock_argument_count
CONFTEST: bitmap_clear
CONFTEST: usleep_range
CONFTEST: radix_tree_empty
CONFTEST: radix_tree_replace_slot
CONFTEST: pnv_npu2_init_context
CONFTEST: cpumask_of_node
CONFTEST: drm_dev_unref
CONFTEST: drm_reinit_primary_mode_group
CONFTEST: get_user_pages_remote
CONFTEST: get_user_pages
CONFTEST: drm_gem_object_lookup
CONFTEST: drm_atomic_state_ref_counting
CONFTEST: drm_driver_has_gem_prime_res_obj
CONFTEST: drm_atomic_helper_connector_dpms
CONFTEST: drm_connector_funcs_have_mode_in_name
CONFTEST: drm_framebuffer_get
CONFTEST: drm_dev_put
CONFTEST: drm_format_num_planes
CONFTEST: drm_connector_for_each_possible_encoder
CONFTEST: drm_rotation_available
CONFTEST: drm_vma_offset_exact_lookup_locked
CONFTEST: is_export_symbol_gpl_of_node_to_nid
CONFTEST: is_export_symbol_gpl_sme_active
CONFTEST: is_export_symbol_present_swiotlb_map_sg_attrs
CONFTEST: is_export_symbol_present_swiotlb_dma_ops
CONFTEST: is_export_symbol_present___close_fd
CONFTEST: is_export_symbol_present_close_fd
CONFTEST: is_export_symbol_present_get_unused_fd
CONFTEST: is_export_symbol_present_get_unused_fd_flags
CONFTEST: is_export_symbol_present_nvhost_get_default_device
CONFTEST: is_export_symbol_present_nvhost_syncpt_unit_interface_get_byte_offset
CONFTEST: is_export_symbol_present_nvhost_syncpt_unit_interface_get_aperture
CONFTEST: is_export_symbol_present_tegra_dce_register_ipc_client
CONFTEST: is_export_symbol_present_tegra_dce_unregister_ipc_client
CONFTEST: is_export_symbol_present_tegra_dce_client_ipc_send_recv
CONFTEST: is_export_symbol_present_dram_clk_to_mc_clk
CONFTEST: is_export_symbol_present_get_dram_num_channels
CONFTEST: is_export_symbol_present_tegra_dram_types
CONFTEST: is_export_symbol_present_kthread_create_on_node
CONFTEST: acpi_op_remove
CONFTEST: file_operations
CONFTEST: file_inode
CONFTEST: kuid_t
CONFTEST: dma_ops
CONFTEST: swiotlb_dma_ops
CONFTEST: noncoherent_swiotlb_dma_ops
CONFTEST: vm_fault_has_address
CONFTEST: backlight_properties_type
CONFTEST: vm_insert_pfn_prot
CONFTEST: vmf_insert_pfn_prot
CONFTEST: vm_ops_fault_removed_vma_arg
CONFTEST: vmbus_channel_has_ringbuffer_page
CONFTEST: device_driver_of_match_table
CONFTEST: device_of_node
CONFTEST: node_states_n_memory
CONFTEST: kmem_cache_has_kobj_remove_work
CONFTEST: sysfs_slab_unlink
CONFTEST: proc_ops
CONFTEST: timespec64
CONFTEST: vmalloc_has_pgprot_t_arg
CONFTEST: acpi_fadt_low_power_s0
CONFTEST: mm_has_mmap_lock
CONFTEST: pci_channel_state
CONFTEST: address_space
CONFTEST: backing_dev_info
CONFTEST: mm_context_t
CONFTEST: vm_fault_t
CONFTEST: mmu_notifier_ops_invalidate_range
CONFTEST: drm_bus_present
CONFTEST: drm_bus_has_bus_type
CONFTEST: drm_bus_has_get_irq
CONFTEST: drm_bus_has_get_name
CONFTEST: drm_driver_has_device_list
CONFTEST: drm_driver_has_legacy_dev_list
CONFTEST: drm_driver_has_set_busid
CONFTEST: drm_crtc_state_has_connectors_changed
CONFTEST: drm_init_function_args
CONFTEST: drm_helper_mode_fill_fb_struct
CONFTEST: drm_master_drop_has_from_release_arg
CONFTEST: drm_driver_unload_has_int_return_type
CONFTEST: drm_atomic_helper_crtc_destroy_state_has_crtc_arg
CONFTEST: drm_atomic_helper_plane_destroy_state_has_plane_arg
CONFTEST: drm_mode_object_find_has_file_priv_arg
CONFTEST: dma_buf_owner
CONFTEST: drm_connector_list_iter
CONFTEST: drm_atomic_helper_swap_state_has_stall_arg
CONFTEST: drm_driver_prime_flag_present
CONFTEST: drm_gem_object_has_resv
CONFTEST: drm_crtc_state_has_async_flip
CONFTEST: drm_crtc_state_has_pageflip_flags
CONFTEST: drm_format_modifiers_present
CONFTEST: drm_vma_node_is_allowed_has_tag_arg
CONFTEST: drm_vma_offset_node_has_readonly
CONFTEST: drm_display_mode_has_vrefresh
CONFTEST: drm_driver_master_set_has_int_return_type
CONFTEST: drm_driver_has_gem_free_object
CONFTEST: drm_prime_pages_to_sg_has_drm_device_arg
CONFTEST: drm_driver_has_gem_prime_callbacks
CONFTEST: drm_crtc_atomic_check_has_atomic_state_arg
CONFTEST: drm_gem_object_vmap_has_map_arg
CONFTEST: drm_plane_atomic_check_has_atomic_state_arg
CONFTEST: drm_device_has_pdev
CONFTEST: dom0_kernel_present
CONFTEST: nvidia_vgpu_kvm_build
CONFTEST: nvidia_grid_build
CONFTEST: nvidia_grid_csp_build
CONFTEST: pm_runtime_available
CONFTEST: pci_class_multimedia_hd_audio
CONFTEST: drm_available
CONFTEST: drm_atomic_available
CONFTEST: is_export_symbol_gpl_refcount_inc
CONFTEST: is_export_symbol_gpl_refcount_dec_and_test
CONFTEST: drm_alpha_blending_available
CONFTEST: ib_peer_memory_symbols
cc -Wp,-MMD,/var/lib/dkms/nvidia/470.86/build/nvidia/.nv.o.d -nostdinc -isystem /usr/lib/gcc/x86_64-linux-gnu/9/include -I./arch/x86/include -I./arch/x86/include/generated -I./include -I./arch/x86/include/uapi -I./arch/x86/include/generated/uapi -I./include/uapi -I./include/generated/uapi -include ./include/linux/compiler-version.h -include ./include/linux/kconfig.h -include ./include/linux/compiler_types.h -D__KERNEL__ -fmacro-prefix-map=./= -Wall -Wundef -Werror=strict-prototypes -Wno-trigraphs -fno-strict-aliasing -fno-common -fshort-wchar -fno-PIE -Werror=implicit-function-declaration -Werror=implicit-int -Werror=return-type -Wno-format-security -std=gnu89 -mno-sse -mno-mmx -mno-sse2 -mno-3dnow -mno-avx -fcf-protection=none -m64 -falign-jumps=1 -falign-loops=1 -mno-80387 -mno-fp-ret-in-387 -mpreferred-stack-boundary=3 -mskip-rax-setup -mtune=generic -mno-red-zone -mcmodel=kernel -DCONFIG_X86_X32_ABI -Wno-sign-compare -fno-asynchronous-unwind-tables -mindirect-branch=thunk-extern -mindirect-branch-register -fno-jump-tables -fno-delete-null-pointer-checks -Wno-frame-address -Wno-format-truncation -Wno-format-overflow -Wno-address-of-packed-member -O2 --param=allow-store-data-races=0 -Wframe-larger-than=1024 -fstack-protector-strong -Wimplicit-fallthrough -Wno-unused-but-set-variable -Wno-unused-const-variable -fno-omit-frame-pointer -fno-optimize-sibling-calls -fno-stack-clash-protection -g -gdwarf-4 -pg -mrecord-mcount -mfentry -DCC_USING_FENTRY -fcf-protection=none -Wdeclaration-after-statement -Wvla -Wno-pointer-sign -Wno-stringop-truncation -Wno-array-bounds -Wno-stringop-overflow -Wno-restrict -Wno-maybe-uninitialized -fno-strict-overflow -fno-stack-check -fconserve-stack -Werror=date-time -Werror=incompatible-pointer-types -Werror=designated-init -Wno-packed-not-aligned -I/var/lib/dkms/nvidia/470.86/build/common/inc -I/var/lib/dkms/nvidia/470.86/build -Wall -MD -Wno-cast-qual -Wno-error -Wno-format-extra-args -D__KERNEL__ -DMODULE -DNVRM -DNV_VERSION_STRING="470.86" -Wno-unused-function -Wuninitialized -fno-strict-aliasing -mno-red-zone -mcmodel=kernel -DNV_UVM_ENABLE -Werror=undef -DNV_SPECTRE_V2=0 -DNV_KERNEL_INTERFACE_LAYER -fno-stack-clash-protection -fcf-protection=none -I/var/lib/dkms/nvidia/470.86/build/nvidia -DNVIDIA_UNDEF_LEGACY_BIT_MACROS -UDEBUG -U_DEBUG -DNDEBUG -DMODULE -DKBUILD_BASENAME='"nv"' -DKBUILD_MODNAME='"nvidia"' -D__KBUILD_MODNAME=kmod_nvidia -c -o /var/lib/dkms/nvidia/470.86/build/nvidia/nv.o /var/lib/dkms/nvidia/470.86/build/nvidia/nv.c
cc -Wp,-MMD,/var/lib/dkms/nvidia/470.86/build/nvidia/.nv-pci.o.d -nostdinc -isystem /usr/lib/gcc/x86_64-linux-gnu/9/include -I./arch/x86/include -I./arch/x86/include/generated -I./include -I./arch/x86/include/uapi -I./arch/x86/include/generated/uapi -I./include/uapi -I./include/generated/uapi -include ./include/linux/compiler-version.h -include ./include/linux/kconfig.h -include ./include/linux/compiler_types.h -D__KERNEL__ -fmacro-prefix-map=./= -Wall -Wundef -Werror=strict-prototypes -Wno-trigraphs -fno-strict-aliasing -fno-common -fshort-wchar -fno-PIE -Werror=implicit-function-declaration -Werror=implicit-int -Werror=return-type -Wno-format-security -std=gnu89 -mno-sse -mno-mmx -mno-sse2 -mno-3dnow -mno-avx -fcf-protection=none -m64 -falign-jumps=1 -falign-loops=1 -mno-80387 -mno-fp-ret-in-387 -mpreferred-stack-boundary=3 -mskip-rax-setup -mtune=generic -mno-red-zone -mcmodel=kernel -DCONFIG_X86_X32_ABI -Wno-sign-compare -fno-asynchronous-unwind-tables -mindirect-branch=thunk-extern -mindirect-branch-register -fno-jump-tables -fno-delete-null-pointer-checks -Wno-frame-address -Wno-format-truncation -Wno-format-overflow -Wno-address-of-packed-member -O2 --param=allow-store-data-races=0 -Wframe-larger-than=1024 -fstack-protector-strong -Wimplicit-fallthrough -Wno-unused-but-set-variable -Wno-unused-const-variable -fno-omit-frame-pointer -fno-optimize-sibling-calls -fno-stack-clash-protection -g -gdwarf-4 -pg -mrecord-mcount -mfentry -DCC_USING_FENTRY -fcf-protection=none -Wdeclaration-after-statement -Wvla -Wno-pointer-sign -Wno-stringop-truncation -Wno-array-bounds -Wno-stringop-overflow -Wno-restrict -Wno-maybe-uninitialized -fno-strict-overflow -fno-stack-check -fconserve-stack -Werror=date-time -Werror=incompatible-pointer-types -Werror=designated-init -Wno-packed-not-aligned -I/var/lib/dkms/nvidia/470.86/build/common/inc -I/var/lib/dkms/nvidia/470.86/build -Wall -MD -Wno-cast-qual -Wno-error -Wno-format-extra-args -D__KERNEL__ -DMODULE -DNVRM -DNV_VERSION_STRING="470.86" -Wno-unused-function -Wuninitialized -fno-strict-aliasing -mno-red-zone -mcmodel=kernel -DNV_UVM_ENABLE -Werror=undef -DNV_SPECTRE_V2=0 -DNV_KERNEL_INTERFACE_LAYER -fno-stack-clash-protection -fcf-protection=none -I/var/lib/dkms/nvidia/470.86/build/nvidia -DNVIDIA_UNDEF_LEGACY_BIT_MACROS -UDEBUG -U_DEBUG -DNDEBUG -DMODULE -DKBUILD_BASENAME='"nv_pci"' -DKBUILD_MODNAME='"nvidia"' -D__KBUILD_MODNAME=kmod_nvidia -c -o /var/lib/dkms/nvidia/470.86/build/nvidia/nv-pci.o /var/lib/dkms/nvidia/470.86/build/nvidia/nv-pci.c
cc -Wp,-MMD,/var/lib/dkms/nvidia/470.86/build/nvidia/.nv-acpi.o.d -nostdinc -isystem /usr/lib/gcc/x86_64-linux-gnu/9/include -I./arch/x86/include -I./arch/x86/include/generated -I./include -I./arch/x86/include/uapi -I./arch/x86/include/generated/uapi -I./include/uapi -I./include/generated/uapi -include ./include/linux/compiler-version.h -include ./include/linux/kconfig.h -include ./include/linux/compiler_types.h -D__KERNEL__ -fmacro-prefix-map=./= -Wall -Wundef -Werror=strict-prototypes -Wno-trigraphs -fno-strict-aliasing -fno-common -fshort-wchar -fno-PIE -Werror=implicit-function-declaration -Werror=implicit-int -Werror=return-type -Wno-format-security -std=gnu89 -mno-sse -mno-mmx -mno-sse2 -mno-3dnow -mno-avx -fcf-protection=none -m64 -falign-jumps=1 -falign-loops=1 -mno-80387 -mno-fp-ret-in-387 -mpreferred-stack-boundary=3 -mskip-rax-setup -mtune=generic -mno-red-zone -mcmodel=kernel -DCONFIG_X86_X32_ABI -Wno-sign-compare -fno-asynchronous-unwind-tables -mindirect-branch=thunk-extern -mindirect-branch-register -fno-jump-tables -fno-delete-null-pointer-checks -Wno-frame-address -Wno-format-truncation -Wno-format-overflow -Wno-address-of-packed-member -O2 --param=allow-store-data-races=0 -Wframe-larger-than=1024 -fstack-protector-strong -Wimplicit-fallthrough -Wno-unused-but-set-variable -Wno-unused-const-variable -fno-omit-frame-pointer -fno-optimize-sibling-calls -fno-stack-clash-protection -g -gdwarf-4 -pg -mrecord-mcount -mfentry -DCC_USING_FENTRY -fcf-protection=none -Wdeclaration-after-statement -Wvla -Wno-pointer-sign -Wno-stringop-truncation -Wno-array-bounds -Wno-stringop-overflow -Wno-restrict -Wno-maybe-uninitialized -fno-strict-overflow -fno-stack-check -fconserve-stack -Werror=date-time -Werror=incompatible-pointer-types -Werror=designated-init -Wno-packed-not-aligned -I/var/lib/dkms/nvidia/470.86/build/common/inc -I/var/lib/dkms/nvidia/470.86/build -Wall -MD -Wno-cast-qual -Wno-error -Wno-format-extra-args -D__KERNEL__ -DMODULE -DNVRM -DNV_VERSION_STRING="470.86" -Wno-unused-function -Wuninitialized -fno-strict-aliasing -mno-red-zone -mcmodel=kernel -DNV_UVM_ENABLE -Werror=undef -DNV_SPECTRE_V2=0 -DNV_KERNEL_INTERFACE_LAYER -fno-stack-clash-protection -fcf-protection=none -I/var/lib/dkms/nvidia/470.86/build/nvidia -DNVIDIA_UNDEF_LEGACY_BIT_MACROS -UDEBUG -U_DEBUG -DNDEBUG -DMODULE -DKBUILD_BASENAME='"nv_acpi"' -DKBUILD_MODNAME='"nvidia"' -D__KBUILD_MODNAME=kmod_nvidia -c -o /var/lib/dkms/nvidia/470.86/build/nvidia/nv-acpi.o /var/lib/dkms/nvidia/470.86/build/nvidia/nv-acpi.c
cc -Wp,-MMD,/var/lib/dkms/nvidia/470.86/build/nvidia/.nv-cray.o.d -nostdinc -isystem /usr/lib/gcc/x86_64-linux-gnu/9/include -I./arch/x86/include -I./arch/x86/include/generated -I./include -I./arch/x86/include/uapi -I./arch/x86/include/generated/uapi -I./include/uapi -I./include/generated/uapi -include ./include/linux/compiler-version.h -include ./include/linux/kconfig.h -include ./include/linux/compiler_types.h -D__KERNEL__ -fmacro-prefix-map=./= -Wall -Wundef -Werror=strict-prototypes -Wno-trigraphs -fno-strict-aliasing -fno-common -fshort-wchar -fno-PIE -Werror=implicit-function-declaration -Werror=implicit-int -Werror=return-type -Wno-format-security -std=gnu89 -mno-sse -mno-mmx -mno-sse2 -mno-3dnow -mno-avx -fcf-protection=none -m64 -falign-jumps=1 -falign-loops=1 -mno-80387 -mno-fp-ret-in-387 -mpreferred-stack-boundary=3 -mskip-rax-setup -mtune=generic -mno-red-zone -mcmodel=kernel -DCONFIG_X86_X32_ABI -Wno-sign-compare -fno-asynchronous-unwind-tables -mindirect-branch=thunk-extern -mindirect-branch-register -fno-jump-tables -fno-delete-null-pointer-checks -Wno-frame-address -Wno-format-truncation -Wno-format-overflow -Wno-address-of-packed-member -O2 --param=allow-store-data-races=0 -Wframe-larger-than=1024 -fstack-protector-strong -Wimplicit-fallthrough -Wno-unused-but-set-variable -Wno-unused-const-variable -fno-omit-frame-pointer -fno-optimize-sibling-calls -fno-stack-clash-protection -g -gdwarf-4 -pg -mrecord-mcount -mfentry -DCC_USING_FENTRY -fcf-protection=none -Wdeclaration-after-statement -Wvla -Wno-pointer-sign -Wno-stringop-truncation -Wno-array-bounds -Wno-stringop-overflow -Wno-restrict -Wno-maybe-uninitialized -fno-strict-overflow -fno-stack-check -fconserve-stack -Werror=date-time -Werror=incompatible-pointer-types -Werror=designated-init -Wno-packed-not-aligned -I/var/lib/dkms/nvidia/470.86/build/common/inc -I/var/lib/dkms/nvidia/470.86/build -Wall -MD -Wno-cast-qual -Wno-error -Wno-format-extra-args -D__KERNEL__ -DMODULE -DNVRM -DNV_VERSION_STRING="470.86" -Wno-unused-function -Wuninitialized -fno-strict-aliasing -mno-red-zone -mcmodel=kernel -DNV_UVM_ENABLE -Werror=undef -DNV_SPECTRE_V2=0 -DNV_KERNEL_INTERFACE_LAYER -fno-stack-clash-protection -fcf-protection=none -I/var/lib/dkms/nvidia/470.86/build/nvidia -DNVIDIA_UNDEF_LEGACY_BIT_MACROS -UDEBUG -U_DEBUG -DNDEBUG -DMODULE -DKBUILD_BASENAME='"nv_cray"' -DKBUILD_MODNAME='"nvidia"' -D__KBUILD_MODNAME=kmod_nvidia -c -o /var/lib/dkms/nvidia/470.86/build/nvidia/nv-cray.o /var/lib/dkms/nvidia/470.86/build/nvidia/nv-cray.c
cc -Wp,-MMD,/var/lib/dkms/nvidia/470.86/build/nvidia/.nv-dma.o.d -nostdinc -isystem /usr/lib/gcc/x86_64-linux-gnu/9/include -I./arch/x86/include -I./arch/x86/include/generated -I./include -I./arch/x86/include/uapi -I./arch/x86/include/generated/uapi -I./include/uapi -I./include/generated/uapi -include ./include/linux/compiler-version.h -include ./include/linux/kconfig.h -include ./include/linux/compiler_types.h -D__KERNEL__ -fmacro-prefix-map=./= -Wall -Wundef -Werror=strict-prototypes -Wno-trigraphs -fno-strict-aliasing -fno-common -fshort-wchar -fno-PIE -Werror=implicit-function-declaration -Werror=implicit-int -Werror=return-type -Wno-format-security -std=gnu89 -mno-sse -mno-mmx -mno-sse2 -mno-3dnow -mno-avx -fcf-protection=none -m64 -falign-jumps=1 -falign-loops=1 -mno-80387 -mno-fp-ret-in-387 -mpreferred-stack-boundary=3 -mskip-rax-setup -mtune=generic -mno-red-zone -mcmodel=kernel -DCONFIG_X86_X32_ABI -Wno-sign-compare -fno-asynchronous-unwind-tables -mindirect-branch=thunk-extern -mindirect-branch-register -fno-jump-tables -fno-delete-null-pointer-checks -Wno-frame-address -Wno-format-truncation -Wno-format-overflow -Wno-address-of-packed-member -O2 --param=allow-store-data-races=0 -Wframe-larger-than=1024 -fstack-protector-strong -Wimplicit-fallthrough -Wno-unused-but-set-variable -Wno-unused-const-variable -fno-omit-frame-pointer -fno-optimize-sibling-calls -fno-stack-clash-protection -g -gdwarf-4 -pg -mrecord-mcount -mfentry -DCC_USING_FENTRY -fcf-protection=none -Wdeclaration-after-statement -Wvla -Wno-pointer-sign -Wno-stringop-truncation -Wno-array-bounds -Wno-stringop-overflow -Wno-restrict -Wno-maybe-uninitialized -fno-strict-overflow -fno-stack-check -fconserve-stack -Werror=date-time -Werror=incompatible-pointer-types -Werror=designated-init -Wno-packed-not-aligned -I/var/lib/dkms/nvidia/470.86/build/common/inc -I/var/lib/dkms/nvidia/470.86/build -Wall -MD -Wno-cast-qual -Wno-error -Wno-format-extra-args -D__KERNEL__ -DMODULE -DNVRM -DNV_VERSION_STRING="470.86" -Wno-unused-function -Wuninitialized -fno-strict-aliasing -mno-red-zone -mcmodel=kernel -DNV_UVM_ENABLE -Werror=undef -DNV_SPECTRE_V2=0 -DNV_KERNEL_INTERFACE_LAYER -fno-stack-clash-protection -fcf-protection=none -I/var/lib/dkms/nvidia/470.86/build/nvidia -DNVIDIA_UNDEF_LEGACY_BIT_MACROS -UDEBUG -U_DEBUG -DNDEBUG -DMODULE -DKBUILD_BASENAME='"nv_dma"' -DKBUILD_MODNAME='"nvidia"' -D__KBUILD_MODNAME=kmod_nvidia -c -o /var/lib/dkms/nvidia/470.86/build/nvidia/nv-dma.o /var/lib/dkms/nvidia/470.86/build/nvidia/nv-dma.c
cc -Wp,-MMD,/var/lib/dkms/nvidia/470.86/build/nvidia/.nv-i2c.o.d -nostdinc -isystem /usr/lib/gcc/x86_64-linux-gnu/9/include -I./arch/x86/include -I./arch/x86/include/generated -I./include -I./arch/x86/include/uapi -I./arch/x86/include/generated/uapi -I./include/uapi -I./include/generated/uapi -include ./include/linux/compiler-version.h -include ./include/linux/kconfig.h -include ./include/linux/compiler_types.h -D__KERNEL__ -fmacro-prefix-map=./= -Wall -Wundef -Werror=strict-prototypes -Wno-trigraphs -fno-strict-aliasing -fno-common -fshort-wchar -fno-PIE -Werror=implicit-function-declaration -Werror=implicit-int -Werror=return-type -Wno-format-security -std=gnu89 -mno-sse -mno-mmx -mno-sse2 -mno-3dnow -mno-avx -fcf-protection=none -m64 -falign-jumps=1 -falign-loops=1 -mno-80387 -mno-fp-ret-in-387 -mpreferred-stack-boundary=3 -mskip-rax-setup -mtune=generic -mno-red-zone -mcmodel=kernel -DCONFIG_X86_X32_ABI -Wno-sign-compare -fno-asynchronous-unwind-tables -mindirect-branch=thunk-extern -mindirect-branch-register -fno-jump-tables -fno-delete-null-pointer-checks -Wno-frame-address -Wno-format-truncation -Wno-format-overflow -Wno-address-of-packed-member -O2 --param=allow-store-data-races=0 -Wframe-larger-than=1024 -fstack-protector-strong -Wimplicit-fallthrough -Wno-unused-but-set-variable -Wno-unused-const-variable -fno-omit-frame-pointer -fno-optimize-sibling-calls -fno-stack-clash-protection -g -gdwarf-4 -pg -mrecord-mcount -mfentry -DCC_USING_FENTRY -fcf-protection=none -Wdeclaration-after-statement -Wvla -Wno-pointer-sign -Wno-stringop-truncation -Wno-array-bounds -Wno-stringop-overflow -Wno-restrict -Wno-maybe-uninitialized -fno-strict-overflow -fno-stack-check -fconserve-stack -Werror=date-time -Werror=incompatible-pointer-types -Werror=designated-init -Wno-packed-not-aligned -I/var/lib/dkms/nvidia/470.86/build/common/inc -I/var/lib/dkms/nvidia/470.86/build -Wall -MD -Wno-cast-qual -Wno-error -Wno-format-extra-args -D__KERNEL__ -DMODULE -DNVRM -DNV_VERSION_STRING="470.86" -Wno-unused-function -Wuninitialized -fno-strict-aliasing -mno-red-zone -mcmodel=kernel -DNV_UVM_ENABLE -Werror=undef -DNV_SPECTRE_V2=0 -DNV_KERNEL_INTERFACE_LAYER -fno-stack-clash-protection -fcf-protection=none -I/var/lib/dkms/nvidia/470.86/build/nvidia -DNVIDIA_UNDEF_LEGACY_BIT_MACROS -UDEBUG -U_DEBUG -DNDEBUG -DMODULE -DKBUILD_BASENAME='"nv_i2c"' -DKBUILD_MODNAME='"nvidia"' -D__KBUILD_MODNAME=kmod_nvidia -c -o /var/lib/dkms/nvidia/470.86/build/nvidia/nv-i2c.o /var/lib/dkms/nvidia/470.86/build/nvidia/nv-i2c.c
cc -Wp,-MMD,/var/lib/dkms/nvidia/470.86/build/nvidia/.nv-p2p.o.d -nostdinc -isystem /usr/lib/gcc/x86_64-linux-gnu/9/include -I./arch/x86/include -I./arch/x86/include/generated -I./include -I./arch/x86/include/uapi -I./arch/x86/include/generated/uapi -I./include/uapi -I./include/generated/uapi -include ./include/linux/compiler-version.h -include ./include/linux/kconfig.h -include ./include/linux/compiler_types.h -D__KERNEL__ -fmacro-prefix-map=./= -Wall -Wundef -Werror=strict-prototypes -Wno-trigraphs -fno-strict-aliasing -fno-common -fshort-wchar -fno-PIE -Werror=implicit-function-declaration -Werror=implicit-int -Werror=return-type -Wno-format-security -std=gnu89 -mno-sse -mno-mmx -mno-sse2 -mno-3dnow -mno-avx -fcf-protection=none -m64 -falign-jumps=1 -falign-loops=1 -mno-80387 -mno-fp-ret-in-387 -mpreferred-stack-boundary=3 -mskip-rax-setup -mtune=generic -mno-red-zone -mcmodel=kernel -DCONFIG_X86_X32_ABI -Wno-sign-compare -fno-asynchronous-unwind-tables -mindirect-branch=thunk-extern -mindirect-branch-register -fno-jump-tables -fno-delete-null-pointer-checks -Wno-frame-address -Wno-format-truncation -Wno-format-overflow -Wno-address-of-packed-member -O2 --param=allow-store-data-races=0 -Wframe-larger-than=1024 -fstack-protector-strong -Wimplicit-fallthrough -Wno-unused-but-set-variable -Wno-unused-const-variable -fno-omit-frame-pointer -fno-optimize-sibling-calls -fno-stack-clash-protection -g -gdwarf-4 -pg -mrecord-mcount -mfentry -DCC_USING_FENTRY -fcf-protection=none -Wdeclaration-after-statement -Wvla -Wno-pointer-sign -Wno-stringop-truncation -Wno-array-bounds -Wno-stringop-overflow -Wno-restrict -Wno-maybe-uninitialized -fno-strict-overflow -fno-stack-check -fconserve-stack -Werror=date-time -Werror=incompatible-pointer-types -Werror=designated-init -Wno-packed-not-aligned -I/var/lib/dkms/nvidia/470.86/build/common/inc -I/var/lib/dkms/nvidia/470.86/build -Wall -MD -Wno-cast-qual -Wno-error -Wno-format-extra-args -D__KERNEL__ -DMODULE -DNVRM -DNV_VERSION_STRING="470.86" -Wno-unused-function -Wuninitialized -fno-strict-aliasing -mno-red-zone -mcmodel=kernel -DNV_UVM_ENABLE -Werror=undef -DNV_SPECTRE_V2=0 -DNV_KERNEL_INTERFACE_LAYER -fno-stack-clash-protection -fcf-protection=none -I/var/lib/dkms/nvidia/470.86/build/nvidia -DNVIDIA_UNDEF_LEGACY_BIT_MACROS -UDEBUG -U_DEBUG -DNDEBUG -DMODULE -DKBUILD_BASENAME='"nv_p2p"' -DKBUILD_MODNAME='"nvidia"' -D__KBUILD_MODNAME=kmod_nvidia -c -o /var/lib/dkms/nvidia/470.86/build/nvidia/nv-p2p.o /var/lib/dkms/nvidia/470.86/build/nvidia/nv-p2p.c
cc -Wp,-MMD,/var/lib/dkms/nvidia/470.86/build/nvidia/.nv-mmap.o.d -nostdinc -isystem /usr/lib/gcc/x86_64-linux-gnu/9/include -I./arch/x86/include -I./arch/x86/include/generated -I./include -I./arch/x86/include/uapi -I./arch/x86/include/generated/uapi -I./include/uapi -I./include/generated/uapi -include ./include/linux/compiler-version.h -include ./include/linux/kconfig.h -include ./include/linux/compiler_types.h -D__KERNEL__ -fmacro-prefix-map=./= -Wall -Wundef -Werror=strict-prototypes -Wno-trigraphs -fno-strict-aliasing -fno-common -fshort-wchar -fno-PIE -Werror=implicit-function-declaration -Werror=implicit-int -Werror=return-type -Wno-format-security -std=gnu89 -mno-sse -mno-mmx -mno-sse2 -mno-3dnow -mno-avx -fcf-protection=none -m64 -falign-jumps=1 -falign-loops=1 -mno-80387 -mno-fp-ret-in-387 -mpreferred-stack-boundary=3 -mskip-rax-setup -mtune=generic -mno-red-zone -mcmodel=kernel -DCONFIG_X86_X32_ABI -Wno-sign-compare -fno-asynchronous-unwind-tables -mindirect-branch=thunk-extern -mindirect-branch-register -fno-jump-tables -fno-delete-null-pointer-checks -Wno-frame-address -Wno-format-truncation -Wno-format-overflow -Wno-address-of-packed-member -O2 --param=allow-store-data-races=0 -Wframe-larger-than=1024 -fstack-protector-strong -Wimplicit-fallthrough -Wno-unused-but-set-variable -Wno-unused-const-variable -fno-omit-frame-pointer -fno-optimize-sibling-calls -fno-stack-clash-protection -g -gdwarf-4 -pg -mrecord-mcount -mfentry -DCC_USING_FENTRY -fcf-protection=none -Wdeclaration-after-statement -Wvla -Wno-pointer-sign -Wno-stringop-truncation -Wno-array-bounds -Wno-stringop-overflow -Wno-restrict -Wno-maybe-uninitialized -fno-strict-overflow -fno-stack-check -fconserve-stack -Werror=date-time -Werror=incompatible-pointer-types -Werror=designated-init -Wno-packed-not-aligned -I/var/lib/dkms/nvidia/470.86/build/common/inc -I/var/lib/dkms/nvidia/470.86/build -Wall -MD -Wno-cast-qual -Wno-error -Wno-format-extra-args -D__KERNEL__ -DMODULE -DNVRM -DNV_VERSION_STRING="470.86" -Wno-unused-function -Wuninitialized -fno-strict-aliasing -mno-red-zone -mcmodel=kernel -DNV_UVM_ENABLE -Werror=undef -DNV_SPECTRE_V2=0 -DNV_KERNEL_INTERFACE_LAYER -fno-stack-clash-protection -fcf-protection=none -I/var/lib/dkms/nvidia/470.86/build/nvidia -DNVIDIA_UNDEF_LEGACY_BIT_MACROS -UDEBUG -U_DEBUG -DNDEBUG -DMODULE -DKBUILD_BASENAME='"nv_mmap"' -DKBUILD_MODNAME='"nvidia"' -D__KBUILD_MODNAME=kmod_nvidia -c -o /var/lib/dkms/nvidia/470.86/build/nvidia/nv-mmap.o /var/lib/dkms/nvidia/470.86/build/nvidia/nv-mmap.c
/var/lib/dkms/nvidia/470.86/build/nvidia/nv-dma.c:963: warning: "IMPORT_SGT_STUBS_NEEDED" redefined
963 | #define IMPORT_SGT_STUBS_NEEDED 0
|
/var/lib/dkms/nvidia/470.86/build/nvidia/nv-dma.c:957: note: this is the location of the previous definition
957 | #define IMPORT_SGT_STUBS_NEEDED 1
|
scripts/basic/fixdep: /lib/x86_64-linux-gnu/libc.so.6: version GLIBC_2.33' not found (required by scripts/basic/fixdep) make[2]: *** [scripts/Makefile.build:272: /var/lib/dkms/nvidia/470.86/build/nvidia/nv-cray.o] Error 1 make[2]: *** Deleting file '/var/lib/dkms/nvidia/470.86/build/nvidia/nv-cray.o' make[2]: *** Waiting for unfinished jobs.... scripts/basic/fixdep: /lib/x86_64-linux-gnu/libc.so.6: version GLIBC_2.33' not found (required by scripts/basic/fixdep)
make[2]: *** [scripts/Makefile.build:272: /var/lib/dkms/nvidia/470.86/build/nvidia/nv-i2c.o] Error 1
make[2]: *** Deleting file '/var/lib/dkms/nvidia/470.86/build/nvidia/nv-i2c.o'
scripts/basic/fixdep: /lib/x86_64-linux-gnu/libc.so.6: version GLIBC_2.33' not found (required by scripts/basic/fixdep) make[2]: *** [scripts/Makefile.build:272: /var/lib/dkms/nvidia/470.86/build/nvidia/nv-pci.o] Error 1 make[2]: *** Deleting file '/var/lib/dkms/nvidia/470.86/build/nvidia/nv-pci.o' scripts/basic/fixdep: /lib/x86_64-linux-gnu/libc.so.6: version GLIBC_2.33' not found (required by scripts/basic/fixdep)
make[2]: *** [scripts/Makefile.build:272: /var/lib/dkms/nvidia/470.86/build/nvidia/nv-mmap.o] Error 1
make[2]: *** Deleting file '/var/lib/dkms/nvidia/470.86/build/nvidia/nv-mmap.o'
scripts/basic/fixdep: /lib/x86_64-linux-gnu/libc.so.6: version GLIBC_2.33' not found (required by scripts/basic/fixdep) make[2]: *** [scripts/Makefile.build:272: /var/lib/dkms/nvidia/470.86/build/nvidia/nv-dma.o] Error 1 make[2]: *** Deleting file '/var/lib/dkms/nvidia/470.86/build/nvidia/nv-dma.o' scripts/basic/fixdep: /lib/x86_64-linux-gnu/libc.so.6: version GLIBC_2.33' not found (required by scripts/basic/fixdep)
make[2]: *** [scripts/Makefile.build:272: /var/lib/dkms/nvidia/470.86/build/nvidia/nv-acpi.o] Error 1
make[2]: *** Deleting file '/var/lib/dkms/nvidia/470.86/build/nvidia/nv-acpi.o'
scripts/basic/fixdep: /lib/x86_64-linux-gnu/libc.so.6: version GLIBC_2.33' not found (required by scripts/basic/fixdep) make[2]: *** [scripts/Makefile.build:272: /var/lib/dkms/nvidia/470.86/build/nvidia/nv-p2p.o] Error 1 make[2]: *** Deleting file '/var/lib/dkms/nvidia/470.86/build/nvidia/nv-p2p.o' scripts/basic/fixdep: /lib/x86_64-linux-gnu/libc.so.6: version GLIBC_2.33' not found (required by scripts/basic/fixdep)
make[2]: *** [scripts/Makefile.build:272: /var/lib/dkms/nvidia/470.86/build/nvidia/nv.o] Error 1
make[2]: *** Deleting file '/var/lib/dkms/nvidia/470.86/build/nvidia/nv.o'
make[1]: *** [Makefile:1853: /var/lib/dkms/nvidia/470.86/build] Error 2
make[1]: Leaving directory '/usr/src/linux-headers-5.13.0-051300-generic'
make: *** [Makefile:80: modules] Error 2
`

Hi and welcome to the forum:)

Nvidia drivers are already included and there is no need for you to download nor install manually.

Open Additional Drives and select Nvidia driver from the list.
Mine looks like this:

5.13 is not official released for zorin, zorin uses 5.11. So it might be kernel related.

@FrenchPress, he is using the nvidia drivers from the repo and not from nvidia site it self. (nvidia-dkms-470 package)

3 Likes

Oops, I overlooked that :sweat_smile:
I still cannot get around to order a new set of glasses :face_with_monocle:

1 Like

I blame the age :wink::stuck_out_tongue_winking_eye:

This is exactly the case; the O.P. is using a non-vetted kernel on Zorin OS combined with a DKMS package.

5 Likes

My guess since you installed a kernel that aren't "supported" by Zorin (as in not from the repositories), you'll need to install the Nvidia driver manually.

4 Likes

Yep sometimes the latest and greatest isn't all it's made out for older units... it's a learning experience.

3 Likes

Or that revert back to the older kernel and install 495 driver.
470 is buggy.

2 Likes

That's always bring me back to this question. Is newer kernel always better than the old?

Right now my husband is running older stable 4,19 kernel with his MXLinux so as my troop of 6 Volumio. Never had a single issue.

My understanding is that in the server application, older stable 4,19 is widely used. It is because... well, it is stable.

1 Like

Nope.
A newer kernel can contain newer drivers for newer hardware. But... It can also be missing older drivers people still need.
They call it regressions.
I call it... something less polite but more accurate.

Many people like to have this image in their mind of the kernel development being a carefully controlled and conscientious effort.

No... no, not really... it's far more slap-dash than that...

2 Likes

I believe its too buggy :stuck_out_tongue: